Running main() from ../ext-googletest/googletest/src/gtest_main.cc
[==========] Running 7 tests from 1 test suite.
[----------] Global test environment set-up.
[----------] 7 tests from FuseMeanWithMeanPassTest
[ RUN      ] FuseMeanWithMeanPassTest.name
[       OK ] FuseMeanWithMeanPassTest.name (0 ms)
[ RUN      ] FuseMeanWithMeanPassTest.fuse_mean_with_mean
[       OK ] FuseMeanWithMeanPassTest.fuse_mean_with_mean (0 ms)
[ RUN      ] FuseMeanWithMeanPassTest.fus_mean_with_mean_NEG
[       OK ] FuseMeanWithMeanPassTest.fus_mean_with_mean_NEG (0 ms)
[ RUN      ] FuseMeanWithMeanPassTest.keep_dims_axes_in_input_rank
../patched/compiler/luci/pass/src/FuseMeanWithMeanPass.test.cpp:196: Failure
Expected equality of these values:
  (std::vector<int32_t>{1, 2})
    Which is: { 1, 2 }
  axes
    Which is: { 1, 3 }

[  FAILED  ] FuseMeanWithMeanPassTest.keep_dims_axes_in_input_rank (0 ms)
[ RUN      ] FuseMeanWithMeanPassTest.keep_dims_last_axis
../patched/compiler/luci/pass/src/FuseMeanWithMeanPass.test.cpp:204: Failure
Expected: axes = fused_axes({1, 2, 3, 4}, {1, 1, 3, 1}, true, 1, 3, fused) doesn't throw an exception.
  Actual: it throws std::out_of_range with description "vector".

../patched/compiler/luci/pass/src/FuseMeanWithMeanPass.test.cpp:205: Failure
Value of: fused
  Actual: false
Expected: true

[  FAILED  ] FuseMeanWithMeanPassTest.keep_dims_last_axis (0 ms)
[ RUN      ] FuseMeanWithMeanPassTest.negative_axis_uses_reduced_rank
../patched/compiler/luci/pass/src/FuseMeanWithMeanPass.test.cpp:215: Failure
Expected equality of these values:
  (std::vector<int32_t>{1, 2})
    Which is: { 1, 2 }
  axes
    Which is: { 1, 3 }

[  FAILED  ] FuseMeanWithMeanPassTest.negative_axis_uses_reduced_rank (0 ms)
[ RUN      ] FuseMeanWithMeanPassTest.negative_last_axis
../patched/compiler/luci/pass/src/FuseMeanWithMeanPass.test.cpp:223: Failure
Expected: axes = fused_axes({1, 64, 20, 32}, {1, 20}, false, 1, -1, fused) doesn't throw an exception.
  Actual: it throws std::out_of_range with description "vector".

../patched/compiler/luci/pass/src/FuseMeanWithMeanPass.test.cpp:224: Failure
Value of: fused
  Actual: false
Expected: true

[  FAILED  ] FuseMeanWithMeanPassTest.negative_last_axis (0 ms)
[----------] 7 tests from FuseMeanWithMeanPassTest (1 ms total)

[----------] Global test environment tear-down
[==========] 7 tests from 1 test suite ran. (1 ms total)
[  PASSED  ] 3 tests.
[  FAILED  ] 4 tests, listed below:
[  FAILED  ] FuseMeanWithMeanPassTest.keep_dims_axes_in_input_rank
[  FAILED  ] FuseMeanWithMeanPassTest.keep_dims_last_axis
[  FAILED  ] FuseMeanWithMeanPassTest.negative_axis_uses_reduced_rank
[  FAILED  ] FuseMeanWithMeanPassTest.negative_last_axis

 4 FAILED TESTS
