Running main() from ../ext-googletest/googletest/src/gtest_main.cc
[==========] Running 6 tests from 4 test suites.
[----------] Global test environment set-up.
[----------] 1 test from FoldGatherTest
[ RUN      ] FoldGatherTest.name
[       OK ] FoldGatherTest.name (0 ms)
[----------] 1 test from FoldGatherTest (0 ms total)

[----------] 3 tests from S64FoldGatherSimpleTest
[ RUN      ] S64FoldGatherSimpleTest.fold_gather_simple
[       OK ] S64FoldGatherSimpleTest.fold_gather_simple (0 ms)
[ RUN      ] S64FoldGatherSimpleTest.illegal_input_NEG
[       OK ] S64FoldGatherSimpleTest.illegal_input_NEG (0 ms)
[ RUN      ] S64FoldGatherSimpleTest.illegal_axis_NEG
[       OK ] S64FoldGatherSimpleTest.illegal_axis_NEG (0 ms)
[----------] 3 tests from S64FoldGatherSimpleTest (0 ms total)

[----------] 1 test from S32FoldGatherTwoDimsTest
[ RUN      ] S32FoldGatherTwoDimsTest.fold_gather_with_two_dim
[       OK ] S32FoldGatherTwoDimsTest.fold_gather_with_two_dim (0 ms)
[----------] 1 test from S32FoldGatherTwoDimsTest (0 ms total)

[----------] 1 test from S32FoldGatherAxis0Test
[ RUN      ] S32FoldGatherAxis0Test.fold_gather_non_last_axis
../patched/compiler/luci/pass/src/FoldGatherPass.test.cpp:288: Failure
Expected equality of these values:
  4
  folded_const->at<loco::DataType::S32>(1)
    Which is: 0

../patched/compiler/luci/pass/src/FoldGatherPass.test.cpp:289: Failure
Expected equality of these values:
  5
  folded_const->at<loco::DataType::S32>(2)
    Which is: 0

[  FAILED  ] S32FoldGatherAxis0Test.fold_gather_non_last_axis (0 ms)
[----------] 1 test from S32FoldGatherAxis0Test (0 ms total)

[----------] Global test environment tear-down
[==========] 6 tests from 4 test suites ran. (0 ms total)
[  PASSED  ] 5 tests.
[  FAILED  ] 1 test, listed below:
[  FAILED  ] S32FoldGatherAxis0Test.fold_gather_non_last_axis

 1 FAILED TEST
