Scope: real function bodies with hist moments and supplied loadings; full package and C++ not loaded.
.F.F                                                                     [100%]
=================================== FAILURES ===================================
_ test_bayesian_weights_satisfy_excess_return_first_order_condition[False-0.004] _
tests/test_bayesian_equilibrium_weights.py:25: in test_bayesian_weights_satisfy_excess_return_first_order_condition
    np.testing.assert_allclose(
E   AssertionError: 
E   Not equal to tolerance rtol=1e-10, atol=1e-12
E   
E   Mismatched elements: 3 / 3 (100%)
E   Max absolute difference among violations: 0.004
E   Max relative difference among violations: 0.50990187
E    ACTUAL: array([[0.013965],
E          [0.011845],
E          [0.01603 ]])
E    DESIRED: array([[0.009965],
E          [0.007845],
E          [0.01203 ]])
_ test_bayesian_weights_satisfy_excess_return_first_order_condition[True-0.004] _
tests/test_bayesian_equilibrium_weights.py:25: in test_bayesian_weights_satisfy_excess_return_first_order_condition
    np.testing.assert_allclose(
E   AssertionError: 
E   Not equal to tolerance rtol=1e-10, atol=1e-12
E   
E   Mismatched elements: 3 / 3 (100%)
E   Max absolute difference among violations: 0.004
E   Max relative difference among violations: 0.4063122
E    ACTUAL: array([[0.014965],
E          [0.013845],
E          [0.01503 ]])
E    DESIRED: array([[0.010965],
E          [0.009845],
E          [0.01103 ]])
=========================== short test summary info ============================
FAILED tests/test_bayesian_equilibrium_weights.py::test_bayesian_weights_satisfy_excess_return_first_order_condition[False-0.004]
FAILED tests/test_bayesian_equilibrium_weights.py::test_bayesian_weights_satisfy_excess_return_first_order_condition[True-0.004]
2 failed, 2 passed in 0.05s
